Target
ALK tyrosine kinase receptor
Ligand
BDBM441922
Substrate
Meas. Tech.
Inhibitory Activity Assay
IC50
5.5±n/a nM
Citation
 Hong, JLiu, GWang, JLe, X Diphenylaminopyrimidine and triazine compound, and pharmaceutical composition and use thereof US Patent  US10647694 Publication Date 5/12/2020 
Target
Name:
ALK tyrosine kinase receptor
Synonyms:
ALK ALK_HUMAN CD_antigen: CD246
Type:
Protein
Mol. Mass.:
176453.10
Organism:
Homo sapiens (Human)
Description:
Q9UM73
Residue:
1620
  
Inhibitor
Name:
BDBM441922
Synonyms:
US10647694, Example 10
Type:
Small organic molecule
Emp. Form.:
C26H32N6O5S
Mol. Mass.:
540.634
SMILES:
COc1cc(C2CCNCC2)c(C)cc1Nc1ncc(c(Nc2ccccc2S(=O)(=O)C(C)C)n1)[N+]([O-])=O
: