Target
ALK tyrosine kinase receptor
Ligand
BDBM441946
Substrate
Meas. Tech.
Inhibitory Activity Assay
IC50
5.5±n/a nM
Citation
 Hong, JLiu, GWang, JLe, X Diphenylaminopyrimidine and triazine compound, and pharmaceutical composition and use thereof US Patent  US10647694 Publication Date 5/12/2020 
Target
Name:
ALK tyrosine kinase receptor
Synonyms:
ALK ALK_HUMAN CD_antigen: CD246
Type:
Protein
Mol. Mass.:
176453.10
Organism:
Homo sapiens (Human)
Description:
Q9UM73
Residue:
1620
  
Inhibitor
Name:
BDBM441946
Synonyms:
US10647694, Example 34
Type:
Small organic molecule
Emp. Form.:
C30H40ClN7O3S
Mol. Mass.:
614.202
SMILES:
COc1cc(ccc1Nc1ncc(Cl)c(Nc2ccccc2S(=O)(=O)C(C)C)n1)N1CCC(CC1)N1CCC(N)CC1
: