Target
ALK tyrosine kinase receptor
Ligand
BDBM441949
Substrate
Meas. Tech.
Inhibitory Activity Assay
IC50
5.5±n/a nM
Citation
 Hong, JLiu, GWang, JLe, X Diphenylaminopyrimidine and triazine compound, and pharmaceutical composition and use thereof US Patent  US10647694 Publication Date 5/12/2020 
Target
Name:
ALK tyrosine kinase receptor
Synonyms:
ALK ALK_HUMAN CD_antigen: CD246
Type:
Protein
Mol. Mass.:
176453.10
Organism:
Homo sapiens (Human)
Description:
Q9UM73
Residue:
1620
  
Inhibitor
Name:
BDBM441949
Synonyms:
US10647694, Example 38 | US10647694, Example 41
Type:
Small organic molecule
Emp. Form.:
C25H31ClN5O2P
Mol. Mass.:
499.973
SMILES:
COc1cc(C2CCNCC2)c(C)cc1Nc1ncc(Cl)c(Nc2ccccc2P(C)(C)=O)n1
: