Target
Protein arginine N-methyltransferase 5
Ligand
BDBM442013
Substrate
Meas. Tech.
Revised Biochemical Assay
IC50
51680±n/a nM
Citation
 Foitzik, RCCamerino, MAWalker, SRLagiakos, HR Tetrahydroisoquinoline derived PRMT5-inhibitors US Patent  US10647708 Publication Date 5/12/2020 
Target
Name:
Protein arginine N-methyltransferase 5
Synonyms:
72 kDa ICln-binding protein HRMT1L5 IBP72 Jak-binding protein 1 PRMT5/MEP50 complex Protein arginine methyltransferase 5 (PRMT5) SKB1 homolog Shk1 kinase-binding protein 1 homolog
Type:
Enzyme
Mol. Mass.:
72679.99
Organism:
Homo sapiens (Human)
Description:
O14744
Residue:
637
  
Inhibitor
Name:
BDBM442013
Synonyms:
US10647708, Compound 4
Type:
Small organic molecule
Emp. Form.:
C22H28N2O5S
Mol. Mass.:
432.533
SMILES:
CS(=O)(=O)c1ccccc1OCC(=O)NCCC(O)CN1CCc2ccccc2C1
: