Target
Non-receptor tyrosine-protein kinase TYK2 [556-888]
Ligand
BDBM442200
Substrate
Meas. Tech.
Binding Assay
Kd
5.5±n/a nM
Citation
 Greenwood, JRLeit de Moradei, SMMasse, CEMcLean, THMondal, S TYK2 inhibitors and uses thereof US Patent  US10647713 Publication Date 5/12/2020 
Target
Name:
Non-receptor tyrosine-protein kinase TYK2 [556-888]
Synonyms:
Non-receptor tyrosine-protein kinase TYK2 (G556-D888) TYK2 TYK2_HUMAN
Type:
Protein
Mol. Mass.:
36941.98
Organism:
Homo sapiens (Human)
Description:
P29597 (aa 556-888)
Residue:
333
  
Inhibitor
Name:
BDBM442200
Synonyms:
US10647713, Compound I-161 | US11396508, Compound I-161
Type:
Small organic molecule
Emp. Form.:
C22H22F2N8O2
Mol. Mass.:
468.4593
SMILES:
COc1cc(ccc1Nc1cc(NC(=O)C2CC2)nc2[nH]c(nc12)C(F)F)-c1nc(C)nn1C
: