Target
Carbonic anhydrase 2
Ligand
BDBM442689
Substrate
Meas. Tech.
Enzyme Inhibition Assay
IC50
6.00±n/a nM
Citation
 Di Giorgio, PHert, JHunziker, DMattei, PRudolph, MSchmitz, PUllmer, C Bicyclic compounds as dual ATX/CA inhibitors US Patent  US10647719 Publication Date 5/12/2020 
Target
Name:
Carbonic anhydrase 2
Synonyms:
CA-II CAC Carbonate dehydratase II Carbonic anhydrase 2 (CA-II) Carbonic anhydrase C Carbonic anhydrase II (CA-II) Carbonic anhydrase II (hCA II) | Carbonic anhydrase isoenzyme II (hCA II)
Type:
Enzyme
Mol. Mass.:
29250.71
Organism:
Homo sapiens (Human)
Description:
P00918
Residue:
260
  
Inhibitor
Name:
BDBM442689
Synonyms:
US10647719, Example 1.00 US10647719, Example 1.02 US10647719, Example 1.04 US10647719, Example 1.06 US10647719, Example 1.08 US10647719, Example 1.10 US10647719, Example 1.12 US10647719, Example 1.14 US10647719, Example 1.16 US10647719, Example 1.18 US10647719, Example 1.20 US10647719, Example 1.22 US10647719, Example 1.24 US10647719, Example 1.26 US10647719, Example 1.28 US10647719, Example 1.30 US10647719, Example 1.32 US10647719, Example 1.34
Type:
Small organic molecule
Emp. Form.:
C26H28F3N5O6S
Mol. Mass.:
595.591
SMILES:
CC(C)(C)C(=O)Nc1cc(cnc1COC(=O)N1CC2=C(C1)CN(C2)C(=O)c1ccc(cc1)S(N)(=O)=O)C(F)(F)F
: