Target
Ataxin-2
Ligand
BDBM442718
Substrate
Meas. Tech.
Inhibition Assay
IC50
8.00±n/a nM
Citation
 Di Giorgio, PHert, JHunziker, DMattei, PRudolph, MSchmitz, PUllmer, C Bicyclic compounds as dual ATX/CA inhibitors US Patent  US10647719 Publication Date 5/12/2020 
Target
Name:
Ataxin-2
Synonyms:
ATX2 ATXN2 Spinocerebellar ataxia type 2 protein Trinucleotide repeat-containing gene 13 protein
Type:
Mol. Mass.:
140337.65
Organism:
Homo sapiens (Human)
Description:
Q99700
Residue:
1313
  
Inhibitor
Name:
BDBM442718
Synonyms:
US10647719, Example 2.00 US10647719, Example 2.02 US10647719, Example 2.04
Type:
Small organic molecule
Emp. Form.:
C26H27ClN6O6S
Mol. Mass.:
587.047
SMILES:
CC(C)(C)C(=O)Nc1cc(C#N)c(Cl)cc1COC(=O)N1CC2=C(C1)CN(C2)C(=O)c1ccc(cn1)S(N)(=O)=O
: