Target
Tissue-type plasminogen activator
Ligand
BDBM297797
Substrate
Meas. Tech.
Plasma-based Clot Lysis Assay
IC50
13.0±n/a nM
Citation
 Ellermann, MValot, GCancho Grande, YHaßfeld, JKinzel, TKöbberling, JBeyer, KRöhrig, SSperzel, MStampfuß, JMeyer, IKöllnberger, MBurkhardt, NSchlemmer, KStegmann, CSchuhmacher, JWerner, MHeiermann, JHengeveld, WJ Piperidinylpyrazolopyrimidinones and their use US Patent  US10118930 Publication Date 11/6/2018 
Target
Name:
Tissue-type plasminogen activator
Synonyms:
Alteplase Reteplase Thrombin receptor protein Tissue-type plasminogen activator (tPA) t-PA t-plasminogen activator
Type:
Enzyme
Mol. Mass.:
62931.08
Organism:
Homo sapiens (Human)
Description:
Residue:
562
  
Inhibitor
Name:
BDBM297797
Synonyms:
N-Benzyl-5-oxo-7-(piperidin-4-yl)-4,5-dihydropyrazolo[1,5-a]pyrimidine-3-carboxamide hydrochloride | US10118930, Example 22
Type:
Small organic molecule
Emp. Form.:
C19H21N5O2
Mol. Mass.:
351.4023
SMILES:
O=C(NCc1ccccc1)c1cnn2c(cc(=O)[nH]c12)C1CCNCC1
: