Target
Tissue-type plasminogen activator
Ligand
BDBM297845
Substrate
Meas. Tech.
Plasma-based Clot Lysis Assay
IC50
11.0±n/a nM
Citation
 Ellermann, MValot, GCancho Grande, YHaßfeld, JKinzel, TKöbberling, JBeyer, KRöhrig, SSperzel, MStampfuß, JMeyer, IKöllnberger, MBurkhardt, NSchlemmer, KStegmann, CSchuhmacher, JWerner, MHeiermann, JHengeveld, WJ Piperidinylpyrazolopyrimidinones and their use US Patent  US10118930 Publication Date 11/6/2018 
Target
Name:
Tissue-type plasminogen activator
Synonyms:
Alteplase Reteplase Thrombin receptor protein Tissue-type plasminogen activator (tPA) t-PA t-plasminogen activator
Type:
Enzyme
Mol. Mass.:
62931.08
Organism:
Homo sapiens (Human)
Description:
Residue:
562
  
Inhibitor
Name:
BDBM297845
Synonyms:
5-[5-Oxo-7-(piperidin-4-yl)-4,5-dihydropyrazolo[1,5-a]pyrimidin-3-yl]thiophene-3-carbonitrile trifluoroacetate | US10118930, Example 68
Type:
Small organic molecule
Emp. Form.:
C16H15N5OS
Mol. Mass.:
325.388
SMILES:
O=c1cc(C2CCNCC2)n2ncc(-c3cc(cs3)C#N)c2[nH]1
: