Target
Tissue-type plasminogen activator
Ligand
BDBM298041
Substrate
Meas. Tech.
Plasma-based Clot Lysis Assay
IC50
8.20±n/a nM
Citation
 Ellermann, MValot, GCancho Grande, YHaßfeld, JKinzel, TKöbberling, JBeyer, KRöhrig, SSperzel, MStampfuß, JMeyer, IKöllnberger, MBurkhardt, NSchlemmer, KStegmann, CSchuhmacher, JWerner, MHeiermann, JHengeveld, WJ Piperidinylpyrazolopyrimidinones and their use US Patent  US10118930 Publication Date 11/6/2018 
Target
Name:
Tissue-type plasminogen activator
Synonyms:
Alteplase Reteplase Thrombin receptor protein Tissue-type plasminogen activator (tPA) t-PA t-plasminogen activator
Type:
Enzyme
Mol. Mass.:
62931.08
Organism:
Homo sapiens (Human)
Description:
Residue:
562
  
Inhibitor
Name:
BDBM298041
Synonyms:
3-(2-methyl-1,3-thiazol-5-yl)-7-(piperidin-4-yl)pyrazolo[1,5-c]pyrimidin-5(4H)-one hydrochloride | US10118930, Example 253
Type:
Small organic molecule
Emp. Form.:
C15H17N5OS
Mol. Mass.:
315.393
SMILES:
Cc1ncc(s1)-c1cnn2c(cc(=O)[nH]c12)C1CCNCC1
: