Target
Tyrosine-protein kinase SYK
Ligand
BDBM322838
Substrate
Meas. Tech.
Enzymatic Syk Kinase Activity
IC50
<10±n/a nM
Citation
 Venkatesan, ASmith, RHosahalli, SPotluri, VPanigrahi, SKBasetti, VKunta, K Pyrimido-pyridazinone compounds and methods of use thereof US Patent  US10647720 Publication Date 5/12/2020 
Target
Name:
Tyrosine-protein kinase SYK
Synonyms:
KSYK_HUMAN Spleen Tyrosine Kinase Tyrosine-protein kinase SYK (Syk)
Type:
Enzyme
Mol. Mass.:
72079.99
Organism:
Homo sapiens (Human)
Description:
P43405
Residue:
635
  
Inhibitor
Name:
BDBM322838
Synonyms:
3-(4-(4-((2-(azepan-1-yl)-5-oxo-5,6- dihydropyrimido[4,5-d]pyridazin-4- yl)amino)phenyl)piperazin-1-yl) propanoic acid US10647720, Ex. # 208
Type:
Small organic molecule
Emp. Form.:
C25H34N8O3
Mol. Mass.:
494.5893
SMILES:
NC(=O)c1c(Nc2ccc(cc2)N2CCN(CCC(O)=O)CC2)nc(nc1C=N)N1CCCCCC1
: