Target
Tyrosine-protein kinase SYK
Ligand
BDBM322897
Substrate
Meas. Tech.
Enzymatic Syk Kinase Activity
IC50
<10±n/a nM
Citation
 Venkatesan, ASmith, RHosahalli, SPotluri, VPanigrahi, SKBasetti, VKunta, K Pyrimido-pyridazinone compounds and methods of use thereof US Patent  US10647720 Publication Date 5/12/2020 
Target
Name:
Tyrosine-protein kinase SYK
Synonyms:
KSYK_HUMAN Spleen Tyrosine Kinase Tyrosine-protein kinase SYK (Syk)
Type:
Enzyme
Mol. Mass.:
72079.99
Organism:
Homo sapiens (Human)
Description:
P43405
Residue:
635
  
Inhibitor
Name:
BDBM322897
Synonyms:
2-(azepan-1-yl)-4-((4-(4-(2- (dimethylamino)ethyl)piperazin-1-yl) phenyl)amino)pyrimido[4,5-d]pyridazin- 5(6H)-one US10647720, Ex. # 267
Type:
Small organic molecule
Emp. Form.:
C26H37N9O
Mol. Mass.:
491.6317
SMILES:
CN(C)CCN1CCN(CC1)c1ccc(Nc2nc(nc3cn[nH]c(=O)c23)N2CCCCCC2)cc1
: