Target
Phosphodiesterase
Ligand
BDBM442748
Substrate
Meas. Tech.
Inhibitory Activity Assay (Lab A)
Ki
468±n/a nM
Citation
 Morriello, GJChang, LForster, ABerger, RNanda, KKShipe, WD Substituted pyrazolo/imidazolo bicyclic compounds as PDE2 inhibitors US Patent  US10647727 Publication Date 5/12/2020 
Target
Name:
Phosphodiesterase
Synonyms:
PDE2A
Type:
Enzyme Catalytic Domain
Mol. Mass.:
105104.20
Organism:
Macaca mulatta (Rhesus macaque)
Description:
Residue:
935
  
Inhibitor
Name:
BDBM442748
Synonyms:
6-Chloro-1- methyl-N-{1-[4- (1-methylethyl)- phenyl]propyl}- 1H-pyrazolo- [3,4-d]pyrimidin- 4-amine | US10647727, Example 6
Type:
Small organic molecule
Emp. Form.:
C18H22ClN5
Mol. Mass.:
343.854
SMILES:
CCC(Nc1nc(Cl)nc2n(C)ncc12)c1ccc(cc1)C(C)C
: