Target
Phosphodiesterase
Ligand
BDBM442765
Substrate
Meas. Tech.
Inhibitory Activity Assay (Lab B)
Ki
55.0±n/a nM
Citation
 Morriello, GJChang, LForster, ABerger, RNanda, KKShipe, WD Substituted pyrazolo/imidazolo bicyclic compounds as PDE2 inhibitors US Patent  US10647727 Publication Date 5/12/2020 
Target
Name:
Phosphodiesterase
Synonyms:
PDE2A
Type:
Enzyme Catalytic Domain
Mol. Mass.:
105104.20
Organism:
Macaca mulatta (Rhesus macaque)
Description:
Residue:
935
  
Inhibitor
Name:
BDBM442765
Synonyms:
N-{1-[3-Fluoro-4- (trifluoromethyl)- phenyl]cyclo- propyl}-1,6- dimethyl-1H- pyrazolo[3,4-d]- pyrimidin-4-amine | US10647727, Example 22
Type:
Small organic molecule
Emp. Form.:
C17H15F4N5O
Mol. Mass.:
381.3275
SMILES:
Cc1nc(NC2(CC2)c2ccc(OC(F)(F)F)c(F)c2)c2cnn(C)c2n1
: