Target
cGMP-dependent 3',5'-cyclic phosphodiesterase
Ligand
BDBM442779
Substrate
Meas. Tech.
Inhibitory Activity Assay (Lab B)
Ki
206±n/a nM
Citation
 Morriello, GJChang, LForster, ABerger, RNanda, KKShipe, WD Substituted pyrazolo/imidazolo bicyclic compounds as PDE2 inhibitors US Patent  US10647727 Publication Date 5/12/2020 
Target
Name:
cGMP-dependent 3',5'-cyclic phosphodiesterase
Synonyms:
CGS-PDE Homo sapiens phosphodiesterase 2A (PDE2A) PDE2A cGSPDE
Type:
Enzyme Catalytic Domain
Mol. Mass.:
105691.58
Organism:
Homo sapiens (Human)
Description:
O00408
Residue:
941
  
Inhibitor
Name:
BDBM442779
Synonyms:
N-{1-[3-Fluoro-4-(trifluoromethyl)phenyl]cyclopropyl}-2-methyl-9H-purin-6-amine | US10647727, Example 36
Type:
Small organic molecule
Emp. Form.:
C16H13F4N5
Mol. Mass.:
351.3015
SMILES:
Cc1nc(NC2(CC2)c2ccc(c(F)c2)C(F)(F)F)c2nc[nH]c2n1
: