Target
Replicase polyprotein 1ab
Ligand
BDBM50010686
Substrate
Meas. Tech.
Hit profiling assay without DTT
IC50
1050±n/a nM
Citation
 Kuzikov, MCostanzi, EReinshagen, JEsposito, FVangeel, LWolf, MEllinger, BClaussen, CGeisslinger, GCorona, AIaconis, DTalarico, CManelfi, CCannalire, RRossetti, GGossen, JAlbani, SMusiani, FHerzog, KYe, YGiabbai, BDemitri, NJochmans, DDe Jonghe, SRymenants, JSumma, VTramontano, EBeccari, ARLeyssen, PStorici, PNeyts, JGribbon, PZaliani, A Identification of inhibitors of SARS-CoV-2 3CL-Pro enzymatic activity using a small molecule in-vitro repurposing screen bioRxiv 2020:0 (2020)    Article 
Target
Name:
Replicase polyprotein 1ab
Synonyms:
ORF1ab polyprotein pp1ab | rep
Type:
Protein
Mol. Mass.:
794070.71
Organism:
2019-nCoV
Description:
P0DTD1
Residue:
7096
  
Inhibitor
Name:
BDBM50010686
Synonyms:
(6aR,12bS)-10,11-Dihydroxy-5,6,6a,7,8,12b-hexahydro-benzo[a]phenanthridinium 10,11-Dihydroxy-5,6,6a,7,8,12b-hexahydro-benzo[a]phenanthridinium(DHX) CHEMBL25856 | dihydrexidine
Type:
Small organic molecule
Emp. Form.:
C17H17NO2
Mol. Mass.:
267.3224
SMILES:
Oc1cc2CC[C@H]3NCc4ccccc4[C@@H]3c2cc1O
: