Target
Replicase polyprotein 1ab
Ligand
BDBM423462
Substrate
Meas. Tech.
Coronavirus 3C Protease FRET Assay
EC50
1400000±n/a nM
Citation
 Kania, RSJr., LJNieman, JA Anticoronaviral compounds and compositions, their pharmaceutical uses and materials for their synthesis WIPO 0:0 (2006) Target
Name:
Replicase polyprotein 1ab
Synonyms:
C3 like protease | nonstructural polyprotein pp1ab
Type:
Mol. Mass.:
790278.87
Organism:
SARS coronavirus Urbani
Description:
Residue:
7073
  
Inhibitor
Name:
BDBM423462
Synonyms:
US11753373, Compound A-5-a WO2006061714-ID-04
Type:
Small Organic Molecule
Emp. Form.:
C23H30N4O5
Mol. Mass.:
442.5081
SMILES:
COc1cccc2[nH]c(cc12)C(=O)N[C@@H](CC(C)C)C(=O)N[C@@H](C[C@@H]1CCNC1=O)C=O
: