Target
Dual specificity tyrosine-phosphorylation-regulated kinase 1A
Ligand
BDBM442831
Substrate
Meas. Tech.
Kinase Assay
EC50
39.0±n/a nM
Citation
 Kc, SKMak, CCHofilena, BJMittapalli, GKEastman, BWCao, JBollu, VChiruta, C 6-(6-membered heteroaryl and aryl)isoquinolin-3-yl carboxamides and preparation and use thereof US Patent  US10653688 Publication Date 5/19/2020 
Target
Name:
Dual specificity tyrosine-phosphorylation-regulated kinase 1A
Synonyms:
DYR1A_HUMAN DYRK1A Dual specificity YAK1-related kinase 1A (Dyrk1A) Dual-specificity tyrosine-phosphorylation regulated kinase 1A HP86 MNBH
Type:
Enzyme
Mol. Mass.:
85616.61
Organism:
Homo sapiens (Human)
Description:
Q13627
Residue:
763
  
Inhibitor
Name:
BDBM442831
Synonyms:
US10653688, Compound 18
Type:
Small organic molecule
Emp. Form.:
C20H19FN4O
Mol. Mass.:
350.3895
SMILES:
Fc1cncc(c1)-c1ccc2cnc(NC(=O)CN3CCCC3)cc2c1
: