Target
Dual specificity tyrosine-phosphorylation-regulated kinase 1A
Ligand
BDBM442821
Substrate
Meas. Tech.
Kinase Assay
EC50
9.00±n/a nM
Citation
 Kc, SKMak, CCHofilena, BJMittapalli, GKEastman, BWCao, JBollu, VChiruta, C 6-(6-membered heteroaryl and aryl)isoquinolin-3-yl carboxamides and preparation and use thereof US Patent  US10653688 Publication Date 5/19/2020 
Target
Name:
Dual specificity tyrosine-phosphorylation-regulated kinase 1A
Synonyms:
DYR1A_HUMAN DYRK1A Dual specificity YAK1-related kinase 1A (Dyrk1A) Dual-specificity tyrosine-phosphorylation regulated kinase 1A HP86 MNBH
Type:
Enzyme
Mol. Mass.:
85616.61
Organism:
Homo sapiens (Human)
Description:
Q13627
Residue:
763
  
Inhibitor
Name:
BDBM442821
Synonyms:
US10653688, Compound 10 US10653688, Compound 62
Type:
Small organic molecule
Emp. Form.:
C20H20N4O2
Mol. Mass.:
348.3984
SMILES:
O=C(CN1CCOCC1)Nc1cc2cc(ccc2cn1)-c1cccnc1
: