Target
Tyrosine-protein kinase JAK3
Ligand
BDBM318872
Substrate
Meas. Tech.
Inhibitory Activity Assay
IC50
<100±n/a nM
Citation
 Qian, XZhu, Y Substituted quinazolines for inhibiting kinase activity US Patent  US10653701 Publication Date 5/19/2020 
Target
Name:
Tyrosine-protein kinase JAK3
Synonyms:
JAK-3 JAK3_HUMAN Janus kinase 3 (JAK3) L-JAK | Leukocyte janus kinase
Type:
Protein
Mol. Mass.:
125111.08
Organism:
Homo sapiens (Human)
Description:
P52333
Residue:
1124
  
Inhibitor
Name:
BDBM318872
Synonyms:
N-(3-(2-((6-(4-methylpiperazin-1-yl)pyridin-3-yl)amino)quinazolin-8-yl)phenyl)acrylamide US10653701, Compound C041 | US11304957, Compound C041
Type:
Small organic molecule
Emp. Form.:
C27H27N7O
Mol. Mass.:
465.5496
SMILES:
CN1CCN(CC1)c1ccc(Nc2ncc3cccc(-c4cccc(NC(=O)C=C)c4)c3n2)cn1
: