Target
Epidermal growth factor receptor [T790M,L858R]
Ligand
BDBM318875
Substrate
Meas. Tech.
Inhibitory Activity Assay
IC50
<100±n/a nM
Citation
 Qian, XZhu, Y Substituted quinazolines for inhibiting kinase activity US Patent  US10653701 Publication Date 5/19/2020 
Target
Name:
Epidermal growth factor receptor [T790M,L858R]
Synonyms:
EGFR EGFR_HUMAN ERBB1 Epidermal growth factor receptor (EGFR)(T790M/L858R) Epidermal growth factor receptor (T790M, L858R) Epidermal growth factor receptor(L858R, T790M) | HER1
Type:
Mol. Mass.:
134353.72
Organism:
Homo sapiens (Human)
Description:
P00533[T790M,L858R]
Residue:
1210
  
Inhibitor
Name:
BDBM318875
Synonyms:
N-(2-fluoro-3-(2-((6-(4-methylpiperazin-1-yl)pyridin-3-yl)amino)quinazolin-8-yl)phenyl)acrylamide US10653701, Compound C048 | US11304957, Compound C048
Type:
Small organic molecule
Emp. Form.:
C27H26FN7O
Mol. Mass.:
483.54
SMILES:
CN1CCN(CC1)c1ccc(Nc2ncc3cccc(-c4cccc(NC(=O)C=C)c4F)c3n2)cn1
: