Target
Histone deacetylase 6
Ligand
BDBM443056
Substrate
Meas. Tech.
In Vitro Enzymatic Assay
IC50
7.00±n/a nM
Citation
 Hammer, KJönsson, MKrüger, L Bicyclic hydroxamic acids useful as inhibitors of mammalian histone deacetylase activity US Patent  US10654814 Publication Date 5/19/2020 
Target
Name:
Histone deacetylase 6
Synonyms:
Cereblon/Histone deacetylase 6 HDAC6 Histone deacetylase 6 (HDAC6) KIAA0901 | ORF Names:JM21
Type:
Chromatin regulator; hydrolase; repressor
Mol. Mass.:
131381.51
Organism:
Homo sapiens (Human)
Description:
Q9UBN7
Residue:
1215
  
Inhibitor
Name:
BDBM443056
Synonyms:
2-([1,1'-biphenyl]-3-ylamino)-N- hydroxy-1-methyl-1H- benzo[d]imidazole-5-carboxamide | US10654814, Example 144
Type:
Small organic molecule
Emp. Form.:
C21H18N4O2
Mol. Mass.:
358.3932
SMILES:
Cn1c(Nc2cccc(c2)-c2ccccc2)nc2cc(ccc12)C(=O)NO
: