Target
Cyclin-dependent kinase 6/G1/S-specific cyclin-D3
Ligand
BDBM443121
Substrate
Meas. Tech.
Inhibition In Vitro Assay
IC50
3300±n/a nM
Citation
 Strum, JCGaston, RDGadwood, RC Antiproliferative pyrimidine-based compounds US Patent  US10654831 Publication Date 5/19/2020 
Target
Name:
Cyclin-dependent kinase 6/G1/S-specific cyclin-D3
Synonyms:
CDK6/CycD3 CDK6/G1/S-specific cyclin D3 Cyclin-dependent kinase 6 | Cyclin-dependent kinase 6/G1/S-specific cyclin D3
Type:
Protein
Mol. Mass.:
Description:
Components:
This complex has 2 components.
Component 1
Name:
Cyclin-dependent kinase 6
Synonyms:
CDK6 CDKN6 Cyclin-dependent kinase 6 (CDK 6) | Serine/threonine-protein kinase PLSTIRE
Type:
Enzyme Subunit
Mol. Mass.:
36937.42
Organism:
Homo sapiens (Human)
Description:
Q00534
Residue:
326
  
Component 2
Name:
G1/S-specific cyclin-D3
Synonyms:
CCND3 | CCND3_HUMAN
Type:
Enzyme
Mol. Mass.:
32521.90
Organism:
Homo sapiens (Human)
Description:
P30281
Residue:
292
  
Inhibitor
Name:
BDBM443121
Synonyms:
US10654831, Compound 46
Type:
Small organic molecule
Emp. Form.:
C20H28N8O
Mol. Mass.:
396.4893
SMILES:
CC(C)[C@H]1CNC(=O)N1c1ccnc(Nc2ccc(cn2)N2CCN(C)CC2)n1
: