Target
Cyclin-dependent kinase 4/G1/S-specific cyclin-D1
Ligand
BDBM443122
Substrate
Meas. Tech.
Inhibition In Vitro Assay
IC50
1500±n/a nM
Citation
 Strum, JCGaston, RDGadwood, RC Antiproliferative pyrimidine-based compounds US Patent  US10654831 Publication Date 5/19/2020 
Target
Name:
Cyclin-dependent kinase 4/G1/S-specific cyclin-D1
Synonyms:
CDK4/CycD CDK4/Cyclin D1 Cyclin-Dependent Kinase 4 (CDK4) Cyclin-dependent kinase 4/G1/S-specific cyclin D1 | Cyclin-dependent kinase 4/cyclin D1
Type:
Protein Complex
Mol. Mass.:
Description:
CDK4/D1 complexes were purified from insect cells co-infected with baculovirus vectors containing each of the components.
Components:
This complex has 2 components.
Component 1
Name:
Cyclin-dependent kinase 4
Synonyms:
CDK4 Cell division protein kinase 4 PSK-J3
Type:
Enzyme Subunit
Mol. Mass.:
33731.96
Organism:
Homo sapiens (Human)
Description:
P11802
Residue:
303
  
Component 2
Name:
G1/S-specific cyclin-D1
Synonyms:
B-cell lymphoma 1 protein BCL-1 oncogene CCND1 PRAD1 | PRAD1 oncogene
Type:
Enzyme Subunit
Mol. Mass.:
33717.70
Organism:
Homo sapiens (Human)
Description:
Residue:
295
  
Inhibitor
Name:
BDBM443122
Synonyms:
US10654831, Compound 52
Type:
Small organic molecule
Emp. Form.:
C18H24N8O
Mol. Mass.:
368.4362
SMILES:
C[C@H]1CNC(=O)N1c1ccnc(Nc2ccc(cn2)N2CCN(C)CC2)n1
: