Target
Neprilysin
Ligand
BDBM298303
Substrate
Meas. Tech.
Enzyme NEP Inhibition Assay
Ki
<1.000±n/a nM
Citation
 Hughes, ADFenster, EFleury, MGendron, RMoran, EJ Neprilysin inhibitors US Patent  US10123984 Publication Date 11/13/2018 
Target
Name:
Neprilysin
Synonyms:
Atriopeptidase CD_antigen=CD10 EPN MME NEP_HUMAN Neutral endopeptidase | Neutral endopeptidase 24.11
Type:
Enzyme
Mol. Mass.:
85505.38
Organism:
Homo sapiens (Human)
Description:
P08473
Residue:
750
  
Inhibitor
Name:
BDBM298303
Synonyms:
US10123984, Example 5-15
Type:
Small organic molecule
Emp. Form.:
C22H21Cl2F2NO6
Mol. Mass.:
504.308
SMILES:
CC(C)OC(=O)C(=O)NC(CC(O)C(O)=O)Cc1cc(Cl)c(cc1F)-c1cc(Cl)ccc1F
: