Target
Neprilysin
Ligand
BDBM298305
Substrate
Meas. Tech.
Enzyme NEP Inhibition Assay
Ki
<1.000±n/a nM
Citation
 Hughes, ADFenster, EFleury, MGendron, RMoran, EJ Neprilysin inhibitors US Patent  US10123984 Publication Date 11/13/2018 
Target
Name:
Neprilysin
Synonyms:
Atriopeptidase CD_antigen=CD10 EPN MME NEP_HUMAN Neutral endopeptidase | Neutral endopeptidase 24.11
Type:
Enzyme
Mol. Mass.:
85505.38
Organism:
Homo sapiens (Human)
Description:
P08473
Residue:
750
  
Inhibitor
Name:
BDBM298305
Synonyms:
US10123984, Example 6A US11547687, Compound Example 5A US20230285340, Example 6A
Type:
Small organic molecule
Emp. Form.:
C20H21NO6
Mol. Mass.:
371.3838
SMILES:
OC[C@H](C[C@@H](Cc1ccc(cc1)-c1ccccc1)NC(=O)C(O)=O)C(O)=O
: