Target
Neprilysin
Ligand
BDBM298317
Substrate
Meas. Tech.
Enzyme NEP Inhibition Assay
Ki
<1.000±n/a nM
Citation
 Hughes, ADFenster, EFleury, MGendron, RMoran, EJ Neprilysin inhibitors US Patent  US10123984 Publication Date 11/13/2018 
Target
Name:
Neprilysin
Synonyms:
Atriopeptidase CD_antigen=CD10 EPN MME NEP_HUMAN Neutral endopeptidase | Neutral endopeptidase 24.11
Type:
Enzyme
Mol. Mass.:
85505.38
Organism:
Homo sapiens (Human)
Description:
P08473
Residue:
750
  
Inhibitor
Name:
BDBM298317
Synonyms:
US10123984, Example 11-2
Type:
Small organic molecule
Emp. Form.:
C27H23Cl2F2NO6
Mol. Mass.:
566.377
SMILES:
C[C@@](CO)(C[C@@H](Cc1ccc(cc1)-c1cc(Cl)c(cc1F)-c1cc(Cl)ccc1F)NC(=O)C(O)=O)C(O)=O
: