Target
OTU domain-containing protein 7B
Ligand
BDBM443234
Substrate
Meas. Tech.
Biochemical Assay
IC50
5500±n/a nM
Citation
 Kemp, MIStockley, MLWoodrow, MDJones, A Spiro-condensed pyrrolidine derivatives as deubiquitylating enzymes (DUB) inhibitors US Patent  US10654853 Publication Date 5/19/2020 
Target
Name:
OTU domain-containing protein 7B
Synonyms:
Cellular zinc finger anti-NF-kappa-B protein OTU7B_HUMAN ZA20D1 Zinc finger protein Cezanne
Type:
Protein
Mol. Mass.:
92527.32
Organism:
Human
Description:
Q6GQQ9
Residue:
843
  
Inhibitor
Name:
BDBM443234
Synonyms:
7'-(4-(Benzyloxy)phenyl)-2'- oxo-1',4'-dihydro-2'H- spiro[pyrrolidine-3,3'- quinoline]-1-carbonitrile | US10654853, Example 7
Type:
Small organic molecule
Emp. Form.:
C26H23N3O2
Mol. Mass.:
409.4797
SMILES:
O=C1Nc2cc(ccc2CC11CCN(C1)C#N)-c1ccc(OCc2ccccc2)cc1
: