Target
OTU domain-containing protein 7B
Ligand
BDBM443246
Substrate
Meas. Tech.
Biochemical Assay
IC50
550±n/a nM
Citation
 Kemp, MIStockley, MLWoodrow, MDJones, A Spiro-condensed pyrrolidine derivatives as deubiquitylating enzymes (DUB) inhibitors US Patent  US10654853 Publication Date 5/19/2020 
Target
Name:
OTU domain-containing protein 7B
Synonyms:
Cellular zinc finger anti-NF-kappa-B protein OTU7B_HUMAN ZA20D1 Zinc finger protein Cezanne
Type:
Protein
Mol. Mass.:
92527.32
Organism:
Human
Description:
Q6GQQ9
Residue:
843
  
Inhibitor
Name:
BDBM443246
Synonyms:
7'-(4-(4-Methylpiperazin-1- yl)phenyl)-2'-oxo-1',4'- dihydro-2'H- spiro[pyrrolidine-3,3'- quinoline]-1-carbonitrile | US10654853, Example 19
Type:
Small organic molecule
Emp. Form.:
C24H27N5O
Mol. Mass.:
401.5041
SMILES:
CN1CCN(CC1)c1ccc(cc1)-c1ccc2CC3(CCN(C3)C#N)C(=O)Nc2c1
: