Target
OTU domain-containing protein 7B
Ligand
BDBM443291
Substrate
Meas. Tech.
Biochemical Assay
IC50
550±n/a nM
Citation
 Kemp, MIStockley, MLWoodrow, MDJones, A Spiro-condensed pyrrolidine derivatives as deubiquitylating enzymes (DUB) inhibitors US Patent  US10654853 Publication Date 5/19/2020 
Target
Name:
OTU domain-containing protein 7B
Synonyms:
Cellular zinc finger anti-NF-kappa-B protein OTU7B_HUMAN ZA20D1 Zinc finger protein Cezanne
Type:
Protein
Mol. Mass.:
92527.32
Organism:
Human
Description:
Q6GQQ9
Residue:
843
  
Inhibitor
Name:
BDBM443291
Synonyms:
(S)-2-Oxo-7-phenyl-1,2-dihydrospiro[pyrido[2,3-b][1,4]oxazine-3,3′-pyrrolidine]-1′-carbonitrile US11236092, Example 64
Type:
Small organic molecule
Emp. Form.:
C17H14N4O2
Mol. Mass.:
306.3187
SMILES:
O=C1Nc2cc(cnc2O[C@]11CCN(C1)C#N)-c1ccccc1
: