Target
OTU domain-containing protein 7B
Ligand
BDBM443322
Substrate
Meas. Tech.
Biochemical Assay
IC50
550±n/a nM
Citation
 Kemp, MIStockley, MLWoodrow, MDJones, A Spiro-condensed pyrrolidine derivatives as deubiquitylating enzymes (DUB) inhibitors US Patent  US10654853 Publication Date 5/19/2020 
Target
Name:
OTU domain-containing protein 7B
Synonyms:
Cellular zinc finger anti-NF-kappa-B protein OTU7B_HUMAN ZA20D1 Zinc finger protein Cezanne
Type:
Protein
Mol. Mass.:
92527.32
Organism:
Human
Description:
Q6GQQ9
Residue:
843
  
Inhibitor
Name:
BDBM443322
Synonyms:
2'-Oxo-6'-(3- (trifluoromethoxy)phenyl)-1',4'- dihydro-2'H-spiro[pyrrolidine-3,3'- quinoline]-1-carbonitrile US11236092, Example 95
Type:
Small organic molecule
Emp. Form.:
C20H16F3N3O2
Mol. Mass.:
387.3551
SMILES:
FC(F)(F)Oc1cccc(c1)-c1ccc2NC(=O)C3(CCN(C3)C#N)Cc2c1
: