Target
OTU domain-containing protein 7B
Ligand
BDBM443373
Substrate
Meas. Tech.
Biochemical Assay
IC50
550±n/a nM
Citation
 Kemp, MIStockley, MLWoodrow, MDJones, A Spiro-condensed pyrrolidine derivatives as deubiquitylating enzymes (DUB) inhibitors US Patent  US10654853 Publication Date 5/19/2020 
Target
Name:
OTU domain-containing protein 7B
Synonyms:
Cellular zinc finger anti-NF-kappa-B protein OTU7B_HUMAN ZA20D1 Zinc finger protein Cezanne
Type:
Protein
Mol. Mass.:
92527.32
Organism:
Human
Description:
Q6GQQ9
Residue:
843
  
Inhibitor
Name:
BDBM443373
Synonyms:
7-(1,4-Dimethyl-1H- pyrazol-5-yl)-2-oxo- 1,4-dihydro-2H- spiro[pyrido[2,3- b]pyrazine-3,3'- pyrrolidine]-1'- carbonitrile | US10654853, Example 146
Type:
Small organic molecule
Emp. Form.:
C16H17N7O
Mol. Mass.:
323.3525
SMILES:
Cc1cnn(C)c1-c1cnc2NC3(CCN(C3)C#N)C(=O)Nc2c1
: