Target
RAC-alpha serine/threonine-protein kinase
Ligand
BDBM256842
Substrate
Meas. Tech.
In Vitro Kinase Assay
IC50
7.50±n/a nM
Citation
 Johnson, PDLeach, ALuke, RWMatusiak, ZSMorris, JJ Protein kinase B inhibitors US Patent  US10654855 Publication Date 5/19/2020 
Target
Name:
RAC-alpha serine/threonine-protein kinase
Synonyms:
AKT phosphorylation (p-AKT) AKT1/PPP1CA C-AKT PKB alpha Protein kinase B Protein kinase B (Akt 1) Protein kinase B alpha Proto-oncogene Akt (Akt1) Proto-oncogene c-Akt (AKT1) RAC-PK-alpha RAC-alpha serine/threonine-protein kinase (AKT1) | RAC-alpha serine/threonine-protein kinase (pAKT)
Type:
Enzyme
Mol. Mass.:
55681.25
Organism:
Homo sapiens (Human)
Description:
P31749
Residue:
480
  
Inhibitor
Name:
BDBM256842
Synonyms:
US10654855, Example 22 US9492453, 22
Type:
Small organic molecule
Emp. Form.:
C20H24ClN7O2
Mol. Mass.:
429.903
SMILES:
NC1(CCN(CC1)c1ncnc2[nH]cnc12)C(=O)N[C@@H](CCO)c1ccc(Cl)cc1
: