Target
RAC-alpha serine/threonine-protein kinase
Ligand
BDBM50427360
Substrate
Meas. Tech.
In Vitro Kinase Assay
IC50
3.70±n/a nM
Citation
 Johnson, PDLeach, ALuke, RWMatusiak, ZSMorris, JJ Protein kinase B inhibitors US Patent  US10654855 Publication Date 5/19/2020 
Target
Name:
RAC-alpha serine/threonine-protein kinase
Synonyms:
AKT phosphorylation (p-AKT) AKT1/PPP1CA C-AKT PKB alpha Protein kinase B Protein kinase B (Akt 1) Protein kinase B alpha Proto-oncogene Akt (Akt1) Proto-oncogene c-Akt (AKT1) RAC-PK-alpha RAC-alpha serine/threonine-protein kinase (AKT1) | RAC-alpha serine/threonine-protein kinase (pAKT)
Type:
Enzyme
Mol. Mass.:
55681.25
Organism:
Homo sapiens (Human)
Description:
P31749
Residue:
480
  
Inhibitor
Name:
BDBM50427360
Synonyms:
CHEMBL2325729 US11236095, Example 52 | US9492453, 52
Type:
Small organic molecule
Emp. Form.:
C26H34ClN7O
Mol. Mass.:
496.047
SMILES:
NC1(CCN(CC1)c1ncnc2[nH]ccc12)C(=O)N[C@@H](CCN1CCCCC1)c1ccc(Cl)cc1
: