Target
Toll-like receptor 7
Ligand
BDBM443391
Substrate
Meas. Tech.
In Vitro Receptor Binding
EC50
550±n/a nM
Citation
 Ding, ZSun, FHu, YZhou, YZhao, RYang, L Method for preparing pyrrolo[3,2-D]pyrimidine compound, and intermediates thereof US Patent  US10654856 Publication Date 5/19/2020 
Target
Name:
Toll-like receptor 7
Synonyms:
ORF Names:UNQ248/PRO285 TLR7_HUMAN | Toll-like receptor 7 (TLR7)
Type:
Enzyme
Mol. Mass.:
120945.35
Organism:
Homo sapiens (Human)
Description:
Q9NYK1
Residue:
1049
  
Inhibitor
Name:
BDBM443391
Synonyms:
US10654856, Compound 16
Type:
Small organic molecule
Emp. Form.:
C24H34N6O
Mol. Mass.:
422.5664
SMILES:
CCCOc1nc(N)c2[nH]cc(Cc3ccc(CN4CCN(CC4)C(C)C)cc3)c2n1
: