Target
Ataxin-2
Ligand
BDBM352271
Substrate
Meas. Tech.
Enzyme Inhibition Assay
IC50
19.0±n/a nM
Citation
 Di Giorgio, PHert, JHunziker, DKuehne, HMattei, PRudolph, M Bicyclic compounds as autotaxin (ATX) and lysophosphatidic acid (LPA) production inhibitors US Patent  US10654857 Publication Date 5/19/2020 
Target
Name:
Ataxin-2
Synonyms:
ATX2 ATXN2 Spinocerebellar ataxia type 2 protein Trinucleotide repeat-containing gene 13 protein
Type:
Mol. Mass.:
140337.65
Organism:
Homo sapiens (Human)
Description:
Q99700
Residue:
1313
  
Inhibitor
Name:
BDBM352271
Synonyms:
5-((3aS,6aS)-5-(5-Cyclopropyl-6-(tetrahydro-2H-pyran-4-yloxy)nicotinoyl)octahydropyrrolo[3,4-c]pyrrole-2-carbonyl)pyridine-2-sulfonamide US11098048, Example 1.2 US9802944, Example 1.01 US9802944, Example 1.03 US9802944, Example 1.05 US9802944, Example 1.07 US9802944, Example 1.09 US9802944, Example 1.11 US9802944, Example 1.13 US9802944, Example 1.15 US9802944, Example 1.17 US9802944, Example 1.19 US9802944, Example 1.21 US9802944, Example 1.23
Type:
Small organic molecule
Emp. Form.:
C26H31N5O6S
Mol. Mass.:
541.619
SMILES:
NS(=O)(=O)c1ccc(cn1)C(=O)N1C[C@H]2CN(C[C@@H]2C1)C(=O)c1cnc(OC2CCOCC2)c(c1)C1CC1
: