Target
Ataxin-2
Ligand
BDBM352339
Substrate
Meas. Tech.
Enzyme Inhibition Assay
IC50
10.00±n/a nM
Citation
 Di Giorgio, PHert, JHunziker, DKuehne, HMattei, PRudolph, M Bicyclic compounds as autotaxin (ATX) and lysophosphatidic acid (LPA) production inhibitors US Patent  US10654857 Publication Date 5/19/2020 
Target
Name:
Ataxin-2
Synonyms:
ATX2 ATXN2 Spinocerebellar ataxia type 2 protein Trinucleotide repeat-containing gene 13 protein
Type:
Mol. Mass.:
140337.65
Organism:
Homo sapiens (Human)
Description:
Q99700
Residue:
1313
  
Inhibitor
Name:
BDBM352339
Synonyms:
4-((3aR,6aS)-5-(5-Cyclopropyl-6-(tetrahydro-2H-pyran-4-yloxy)nicotinoyl)octahydropyrrolo[3,4-c]pyrrole-2-carbonyl)benzenesulfonamide US11098048, Example 2 US9802944, Example 2.1 | US9802944, Example 2.3
Type:
Small organic molecule
Emp. Form.:
C27H32N4O6S
Mol. Mass.:
540.631
SMILES:
NS(=O)(=O)c1ccc(cc1)C(=O)N1C[C@H]2CN(C[C@H]2C1)C(=O)c1cnc(OC2CCOCC2)c(c1)C1CC1
: