Target
Ataxin-2
Ligand
BDBM352382
Substrate
Meas. Tech.
Enzyme Inhibition Assay
IC50
7.00±n/a nM
Citation
 Di Giorgio, PHert, JHunziker, DKuehne, HMattei, PRudolph, M Bicyclic compounds as autotaxin (ATX) and lysophosphatidic acid (LPA) production inhibitors US Patent  US10654857 Publication Date 5/19/2020 
Target
Name:
Ataxin-2
Synonyms:
ATX2 ATXN2 Spinocerebellar ataxia type 2 protein Trinucleotide repeat-containing gene 13 protein
Type:
Mol. Mass.:
140337.65
Organism:
Homo sapiens (Human)
Description:
Q99700
Residue:
1313
  
Inhibitor
Name:
BDBM352382
Synonyms:
((3aR,6aR)-5-(2-Cyclopropyl-6-((tetrahydro-2H-pyran-4-yl)methoxy)isonicotinoyl)-hexahydropyrrolo[3,4-c]pyrrol-2(1H)-yl)(6,7-dihydro-1H-[1,2,3]triazolo[4,5-c]pyridin-5(4H)-yl)methanone US11098048, Example 5 US9802944, Example 5.01 US9802944, Example 5.03 US9802944, Example 5.05
Type:
Small organic molecule
Emp. Form.:
C27H35N7O4
Mol. Mass.:
521.6113
SMILES:
O=C(N1C[C@H]2CN(C[C@@H]2C1)C(=O)c1cc(OCC2CCOCC2)nc(c1)C1CC1)N1CCc2[nH]nnc2C1
: