Target
Rho-associated protein kinase 2
Ligand
BDBM443423
Substrate
Meas. Tech.
In Vitro Assay
IC50
1250±n/a nM
Citation
 Yang, WGlunz, PWBhide, RSThiyagarajan, K Tricyclic rho kinase inhibitors US Patent  US10654860 Publication Date 5/19/2020 
Target
Name:
Rho-associated protein kinase 2
Synonyms:
KIAA0619 ROCK2 Rho kinase 2 (ROCKII) Rho-associated protein kinase 2 (ROCK2) Rho-associated protein kinase 2/Transforming protein RhoA Rho-associated, coiled-coil-containing protein kinase II p164 ROCK-2
Type:
Protein
Mol. Mass.:
160885.43
Organism:
Homo sapiens (Human)
Description:
O75116
Residue:
1388
  
Inhibitor
Name:
BDBM443423
Synonyms:
US10654860, Example 31
Type:
Small organic molecule
Emp. Form.:
C23H25N5O2
Mol. Mass.:
403.4769
SMILES:
CC(C)(C)c1cccc(CN2CCN(C2=O)c2ccc3-c4c[nH]nc4COc3n2)c1
: