Target
Estrogen receptor [Y537S]
Ligand
BDBM443429
Substrate
Meas. Tech.
Competition Binding Assay
Ki
57.2±39.13 nM
Citation
 Bastian, JACohen, JDRubio, ASall, DJ Selective estrogen receptor degraders US Patent  US10654866 Publication Date 5/19/2020 
Target
Name:
Estrogen receptor [Y537S]
Synonyms:
ESR ESR1_HUMAN Estrogen receptor alpha Y537S | NR3A1
Type:
Enzyme Catalytic Domain
Mol. Mass.:
66154.35
Organism:
Homo sapiens (Human)
Description:
P03372[Y537S]
Residue:
595
  
Inhibitor
Name:
BDBM443429
Synonyms:
US10654866, Example 1A US11634426, Example 1A
Type:
Small organic molecule
Emp. Form.:
C29H24F4N2O3
Mol. Mass.:
524.5061
SMILES:
Oc1ccc2c3[C@H](Oc4cc(ccc4-c3cnc2c1)C(F)(F)F)c1ccc(OCCN2CC(CF)C2)cc1
: