Target
Estrogen receptor
Ligand
BDBM443449
Substrate
Meas. Tech.
Competition Binding Assay
Ki
0.590±n/a nM
Citation
 Bastian, JACohen, JDRubio, ASall, DJ Selective estrogen receptor degraders US Patent  US10654866 Publication Date 5/19/2020 
Target
Name:
Estrogen receptor
Synonyms:
ER ESR ESR1_HUMAN Estrogen receptor Estrogen receptor (ER-alpha) Estrogen receptor alpha (ER) Nuclear receptor subfamily 3 group A member 1
Type:
Protein
Mol. Mass.:
66230.44
Organism:
Homo sapiens (Human)
Description:
P03372
Residue:
595
  
Inhibitor
Name:
BDBM443449
Synonyms:
US10654866, Example 3B US11634426, Example 3B
Type:
Small organic molecule
Emp. Form.:
C28H24ClFN2O3
Mol. Mass.:
490.953
SMILES:
Oc1ccc2c3[C@@H](Oc4cc(Cl)ccc4-c3cnc2c1)c1ccc(OCCN2CC(CF)C2)cc1
: