Target
Estrogen receptor [Y537S]
Ligand
BDBM443445
Substrate
Meas. Tech.
Competition Binding Assay
Ki
81.2±n/a nM
Citation
 Bastian, JACohen, JDRubio, ASall, DJ Selective estrogen receptor degraders US Patent  US10654866 Publication Date 5/19/2020 
Target
Name:
Estrogen receptor [Y537S]
Synonyms:
ESR ESR1_HUMAN Estrogen receptor alpha Y537S | NR3A1
Type:
Enzyme Catalytic Domain
Mol. Mass.:
66154.35
Organism:
Homo sapiens (Human)
Description:
P03372[Y537S]
Residue:
595
  
Inhibitor
Name:
BDBM443445
Synonyms:
US10654866, Example 5A US11634426, Example 5A
Type:
Small organic molecule
Emp. Form.:
C28H24F2N2O3
Mol. Mass.:
474.4986
SMILES:
Oc1ccc2c3[C@H](Oc4cc(F)ccc4-c3cnc2c1)c1ccc(OCCN2CC(CF)C2)cc1
: