Target
Complement factor D
Ligand
BDBM303027
Substrate
Meas. Tech.
Inhibition Assay
IC50
>10000±n/a nM
Citation
 Wiles, JAPhadke, ASDeshpande, MAgarwal, AChen, DGadhachanda, VRHashimoto, APais, GWang, QWang, X Amino compounds for treatment of medical disorders US Patent  US10660876 Publication Date 5/26/2020 
Target
Name:
Complement factor D
Synonyms:
Adipsin CFAD_HUMAN DF Properdin factor D
Type:
Protein
Mol. Mass.:
27039.19
Organism:
Homo sapiens (Human)
Description:
P00746
Residue:
253
  
Inhibitor
Name:
BDBM303027
Synonyms:
(2S,4R)-1-(2-(3- acetyl-5-(pyrimidin-5- ylamino)-1H-indol-1- yl)acetyl)-N-(2- (benzo[d]thiazol-2- yl)phenyl)-4- fluoropyrrolidine-2- carboxamide US9598446, Compound 32
Type:
Small organic molecule
Emp. Form.:
C34H28FN7O3S
Mol. Mass.:
633.695
SMILES:
CC(=O)c1cn(CC(=O)N2C[C@H](F)C[C@H]2C(=O)Nc2ccccc2-c2nc3ccccc3s2)c2ccc(Nc3cncnc3)cc12
: