Target
Coagulation factor XI
Ligand
BDBM298279
Substrate
Meas. Tech.
Factor XIa Assay
IC50
2370±n/a nM
Citation
 Mertz, ELiu, WEdmondson, SDAli, AGao, YNeelamkavil, SFSo, SMoningka, RSun, WHruza, ABrockunier, LL Factor XIa inhibitors US Patent  US10123995 Publication Date 11/13/2018 
Target
Name:
Coagulation factor XI
Synonyms:
Coagulation factor XIa Coagulation factor XIa light chain FA11_HUMAN Factor XIa PTA | Plasma thromboplastin antecedent
Type:
Enzyme
Mol. Mass.:
70130.58
Organism:
Homo sapiens (Human)
Description:
P03951
Residue:
625
  
Inhibitor
Name:
BDBM298279
Synonyms:
4-({[(7S)-3-(3-chloro-2,6- difluorophenyl)-1-oxido-6,7- dihydro-5H- cyclopenta[b]pyridin-b7- yl]carbonyl}amino)benzoic acid US10123995, Example 4
Type:
Small organic molecule
Emp. Form.:
C22H15ClF2N2O4
Mol. Mass.:
444.815
SMILES:
OC(=O)c1ccc(NC(=O)C2CCc3cc(c[n+]([O-])c23)-c2c(F)ccc(Cl)c2F)cc1
: