Target
Coagulation factor XI
Ligand
BDBM298332
Substrate
Meas. Tech.
Factor XIa Assay
IC50
2.70±n/a nM
Citation
 Mertz, ELiu, WEdmondson, SDAli, AGao, YNeelamkavil, SFSo, SMoningka, RSun, WHruza, ABrockunier, LL Factor XIa inhibitors US Patent  US10123995 Publication Date 11/13/2018 
Target
Name:
Coagulation factor XI
Synonyms:
Coagulation factor XIa Coagulation factor XIa light chain FA11_HUMAN Factor XIa PTA | Plasma thromboplastin antecedent
Type:
Enzyme
Mol. Mass.:
70130.58
Organism:
Homo sapiens (Human)
Description:
P03951
Residue:
625
  
Inhibitor
Name:
BDBM298332
Synonyms:
US10123995, Example 10
Type:
Small organic molecule
Emp. Form.:
C23H17ClN6O5
Mol. Mass.:
492.871
SMILES:
O[C@@H]1C[C@](O)(C(=O)Nc2ccc(cc2)C(O)=O)c2ncc(cc12)-c1cc(Cl)ccc1-n1cnnn1
: