Target
Toll-like receptor 8
Ligand
BDBM443503
Substrate
Meas. Tech.
Inhibition Reporter Assay
IC50
1.30±n/a nM
Citation
 Dyckman, AJDodd, DSHaque, TSLombardo, LJMacor, JEMussari, CPPasunoori, LPoss, MAKumar, SRPosy, SLTortolani, DRWhiteley, BKSistla, RKHegde, SRamachandra Reddy, AK Pyridyl substituted indole compounds US Patent  US10660877 Publication Date 5/26/2020 
Target
Name:
Toll-like receptor 8
Synonyms:
CD_antigen: CD288 TLR8_HUMAN | TRL8
Type:
Enzyme
Mol. Mass.:
119828.77
Organism:
Homo sapiens (Human)
Description:
Q9NR97
Residue:
1041
  
Inhibitor
Name:
BDBM443503
Synonyms:
US10660877, Example 80
Type:
Small organic molecule
Emp. Form.:
C23H28FN3
Mol. Mass.:
365.4869
SMILES:
CC(C)c1c([nH]c2cc(F)c(cc12)C1CCNCC1)-c1cc(C)ncc1C
: