Target
Toll-like receptor 7
Ligand
BDBM444033
Substrate
Meas. Tech.
Inhibition Reporter Assay
IC50
1.20±n/a nM
Citation
 Dyckman, AJDodd, DSHaque, TSLombardo, LJMacor, JEMussari, CPPasunoori, LPoss, MAKumar, SRPosy, SLTortolani, DRWhiteley, BKSistla, RKHegde, SRamachandra Reddy, AK Pyridyl substituted indole compounds US Patent  US10660877 Publication Date 5/26/2020 
Target
Name:
Toll-like receptor 7
Synonyms:
ORF Names:UNQ248/PRO285 TLR7_HUMAN | Toll-like receptor 7 (TLR7)
Type:
Enzyme
Mol. Mass.:
120945.35
Organism:
Homo sapiens (Human)
Description:
Q9NYK1
Residue:
1049
  
Inhibitor
Name:
BDBM444033
Synonyms:
US10660877, Example 622
Type:
Small organic molecule
Emp. Form.:
C26H33FN4O
Mol. Mass.:
436.5648
SMILES:
CNCC(=O)N1CCC(CC1)c1ccc2[nH]c(c(C(C)C)c2c1)-c1cc(C)nc(C)c1F
: