Target
Toll-like receptor 7
Ligand
BDBM444082
Substrate
Meas. Tech.
Inhibition Reporter Assay
IC50
0.600±n/a nM
Citation
 Dyckman, AJDodd, DSHaque, TSLombardo, LJMacor, JEMussari, CPPasunoori, LPoss, MAKumar, SRPosy, SLTortolani, DRWhiteley, BKSistla, RKHegde, SRamachandra Reddy, AK Pyridyl substituted indole compounds US Patent  US10660877 Publication Date 5/26/2020 
Target
Name:
Toll-like receptor 7
Synonyms:
ORF Names:UNQ248/PRO285 TLR7_HUMAN | Toll-like receptor 7 (TLR7)
Type:
Enzyme
Mol. Mass.:
120945.35
Organism:
Homo sapiens (Human)
Description:
Q9NYK1
Residue:
1049
  
Inhibitor
Name:
BDBM444082
Synonyms:
US10660877, Example 671
Type:
Small organic molecule
Emp. Form.:
C30H44N4
Mol. Mass.:
460.6972
SMILES:
CCN(CC)CCCN1CCC(CC1)c1ccc2[nH]c(c(C(C)C)c2c1)-c1cc(C)nc(C)c1
: