Target
Phosphatidylinositol 4-phosphate 3-kinase C2 domain-containing subunit beta
Ligand
BDBM444300
Substrate
Meas. Tech.
HTRF In vitro Profiling Assay
IC50
3.16±n/a nM
Citation
 Tedesco, RQu, JSanchez, RRivero, RA Benzimidazole derivatives as PI3 kinase inhibitors US Patent  US10660898 Publication Date 5/26/2020 
Target
Name:
Phosphatidylinositol 4-phosphate 3-kinase C2 domain-containing subunit beta
Synonyms:
C2-PI3K PI3K-C2beta Phosphatidylinositol 4-phosphate 3-kinase C2 beta (PIK3C2B) Phosphoinositide 3-Kinase (PI3K), C2beta PtdIns-3-kinase C2 beta
Type:
Enzyme
Mol. Mass.:
184784.86
Organism:
Homo sapiens (Human)
Description:
O00750
Residue:
1634
  
Inhibitor
Name:
BDBM444300
Synonyms:
US10660898, Example 14
Type:
Small organic molecule
Emp. Form.:
C20H21Cl2N3O2
Mol. Mass.:
406.306
SMILES:
CCc1nc2c(O)cc(cc2n1Cc1cccc(Cl)c1Cl)N1CCOCC1
: