Target
Mucosa-associated lymphoid tissue lymphoma translocation protein 1
Ligand
BDBM444336
Substrate
Meas. Tech.
Inhibition of Protease Activity Assay
IC50
2406±n/a nM
Citation
 Numajiri, YOkimura, KMatsumura, YAsaba, KMasuda, TTokumaru, KGoto, YFujii, S Guanidine derivative and medical use thereof US Patent  US10662156 Publication Date 5/26/2020 
Target
Name:
Mucosa-associated lymphoid tissue lymphoma translocation protein 1
Synonyms:
MALT lymphoma-associated translocation MALT1 MLT Paracaspase
Type:
Enzyme
Mol. Mass.:
92257.81
Organism:
Homo sapiens (Human)
Description:
Q9UDY8
Residue:
824
  
Inhibitor
Name:
BDBM444336
Synonyms:
N-(amino(((5-(2-chlorophenyl)-6-(4-chlorophenyl)pyridin-3-yl)methyl)amino)methylene)benzenesulfonamide | US10662156, Compound of Example 16
Type:
Small organic molecule
Emp. Form.:
C25H20Cl2N4O2S
Mol. Mass.:
511.423
SMILES:
N\C(NCc1cnc(-c2ccc(Cl)cc2)c(c1)-c1ccccc1Cl)=N/S(=O)(=O)c1ccccc1
: